Reaction Details
TargetMu-type opioid receptor
LigandBDBM50013935
Substrate/Competitorn/a
Meas. Tech.ChEBML_148837
Ki 2±n/a nM
Citation Lalinde, NMoliterni, JWright, DSpencer, HKOssipov, MHSpaulding, TCRudo, FG Synthesis and pharmacological evaluation of a series of new 3-methyl-1,4-disubstituted-piperidine analgesics. J Med Chem33:2876-82 (1990) Mu-type opioid receptor
Name:Mu-type opioid receptor
Type:G Protein-Coupled Receptor (GPCR)
Mol. Mass.:44503.11
Organism:Rattus norvegicus (rat)
Description:Competition binding assays were carried out using membrane preparations from transfected HN9.10 cells that constitutively expressed the mu opioid receptor.
Residue:398
BDBM50013935
NameBDBM50013935
Synonyms:CHEMBL95390 | N-(2-Fluoro-phenyl)-2-methoxy-N-[3-methyl-1-(2-tetrazol-1-yl-ethyl)-piperidin-4-yl]-acetamide
TypeSmall organic molecule
Emp. Form.C18H25FN6O2
Mol. Mass.376.4285
SMILESCOCC(=O)N(C1CCN(CCn2cnnn2)CC1C)c1ccccc1F