Reaction Details
TargetAlpha-1D adrenergic receptor
LigandBDBM50274049
Substrate/Competitorn/a
Meas. Tech.ChEMBL_1713735 (CHEMBL4123784)
Ki 0.060256±n/a nM
Citation Sagratini, GBuccioni, MMarucci, GPoggesi, ESkorski, MCostanzi, SGiardinà, D Chiral analogues of (+)-cyclazosin as potent? Bioorg Med Chem26:3502-3513 (2018) 
 
Alpha-1D adrenergic receptor
Name:Alpha-1D adrenergic receptor
Type:Enzyme Catalytic Domain
Mol. Mass.:60485.82
Organism:Homo sapiens (Human)
Description:adrenergic Alpha1D ADRA1D HUMAN::P25100
Residue:572
BDBM50274049
NameBDBM50274049
Synonyms:CHEMBL342062
TypeSmall organic molecule
Emp. Form.C23H27N5O4
Mol. Mass.437.4916
SMILES[H][C@@]12CCCC[C@]1([H])N(CCN2C(=O)c1ccco1)c1nc(N)c2cc(OC)c(OC)cc2n1