Reaction Details
TargetAlpha-1D adrenergic receptor
LigandBDBM50274061
Substrate/Competitorn/a
Meas. Tech.ChEMBL_1713735 (CHEMBL4123784)
Ki 0.151356±n/a nM
Citation Sagratini, GBuccioni, MMarucci, GPoggesi, ESkorski, MCostanzi, SGiardinà, D Chiral analogues of (+)-cyclazosin as potent? Bioorg Med Chem26:3502-3513 (2018) 
 
Alpha-1D adrenergic receptor
Name:Alpha-1D adrenergic receptor
Type:Enzyme Catalytic Domain
Mol. Mass.:60485.82
Organism:Homo sapiens (Human)
Description:adrenergic Alpha1D ADRA1D HUMAN::P25100
Residue:572
BDBM50274061
NameBDBM50274061
Synonyms:CHEMBL4129461
TypeSmall organic molecule
Emp. Form.C20H27N5O3
Mol. Mass.385.4601
SMILES[H][C@@]12CCCC[C@]1([H])N(CCN2C(C)=O)c1nc(N)c2cc(OC)c(OC)cc2n1