Reaction Details
TargetAlpha-1D adrenergic receptor
LigandBDBM50274053
Substrate/Competitorn/a
Meas. Tech.ChEMBL_1713735 (CHEMBL4123784)
Ki 0.063096±n/a nM
Citation Sagratini, GBuccioni, MMarucci, GPoggesi, ESkorski, MCostanzi, SGiardinà, D Chiral analogues of (+)-cyclazosin as potent? Bioorg Med Chem26:3502-3513 (2018) 
 
Alpha-1D adrenergic receptor
Name:Alpha-1D adrenergic receptor
Type:Enzyme Catalytic Domain
Mol. Mass.:60485.82
Organism:Homo sapiens (Human)
Description:adrenergic Alpha1D ADRA1D HUMAN::P25100
Residue:572
BDBM50274053
NameBDBM50274053
Synonyms:CHEMBL4126860
TypeSmall organic molecule
Emp. Form.C29H39N5O4
Mol. Mass.521.6511
SMILES[H][C@@]12CCCC[C@]1([H])N(CCN2C(=O)c1ccco1)c1nc(N(CCC)CCC)c2cc(OC)c(OC)cc2n1