Reaction Details
Target5-hydroxytryptamine receptor 1D
LigandBDBM50014946
Substrate/Competitorn/a
Meas. Tech.ChEBML_1640
Ki 1060±n/a nM
Citation Ismaiel, AMTiteler, MMiller, KJSmith, TSGlennon, RA 5-HT1 and 5-HT2 binding profiles of the serotonergic agents alpha-methylserotonin and 2-methylserotonin. J Med Chem33:755-8 (1990) 5-hydroxytryptamine receptor 1D
Name:5-hydroxytryptamine receptor 1D
Type:G Protein-Coupled Receptor (GPCR)
Mol. Mass.:41920.63
Organism:Homo sapiens (Human)
Description:Receptor binding assays were performed using human clone stably expressed in CHO cells.
Residue:377
BDBM50014946
NameBDBM50014946
Synonyms:2-(5-Methoxy-2-methyl-1H-indol-3-yl)-ethylamine CHEMBL268800
TypeSmall organic molecule
Emp. Form.C12H16N2O
Mol. Mass.204.2682
SMILESCOc1ccc2[nH]c(C)c(CCN)c2c1