Reaction Details
Target3-oxo-5-alpha-steroid 4-dehydrogenase 2
LigandBDBM50043604
Substrate/Competitorn/a
Meas. Tech.ChEMBL_204589 (CHEMBL814234)
Ki 30±n/a nM
Citation Holt, DALevy, MAOh, HJErb, JMHeaslip, JIBrandt, MLan-Hargest, HYMetcalf, BW Inhibition of steroid 5 alpha-reductase by unsaturated 3-carboxysteroids. J Med Chem33:943-50 (1990) 3-oxo-5-alpha-steroid 4-dehydrogenase 2
Name:3-oxo-5-alpha-steroid 4-dehydrogenase 2
Type:Enzyme
Mol. Mass.:28406.59
Organism:Homo sapiens (Human)
Description:P31213
Residue:254
BDBM50043604
NameBDBM50043604
Synonyms:(8S,9S,10R,13S,14S,17S)-17-(tert-butylcarbamoyl)-10,13-dimethyl-2,7,8,9,10,11,12,13,14,15,16,17-dodecahydro-1H-cyclopenta[a]phenanthrene-3-carboxylic acid CHEMBL138225 | Epristeride
TypeSmall organic molecule
Emp. Form.C25H37NO3
Mol. Mass.399.5662
SMILESCC(C)(C)NC(=O)[C@H]1CC[C@H]2[C@@H]3CC=C4C=C(CC[C@]4(C)[C@H]3CC[C@]12C)C(O)=O