Reaction Details
TargetLysosomal alpha-glucosidase/Maltase-glucoamylase/Probable maltase-glucoamylase 2/Sucrase-isomaltase, intestinal
LigandBDBM23406
Substrate/Competitorn/a
Meas. Tech.ChEMBL_1720957 (CHEMBL4135957)
IC50 442400±n/a nM
Citation Gao, EZhou, ZQZou, JYu, YFeng, XLChen, GDHe, RRYao, XSGao, H Bioactive Asarone-Derived Phenylpropanoids from the Rhizome of Acorus tatarinowii Schott. J Nat Prod80:2923-2929 (2017) 
 
Lysosomal alpha-glucosidase/Maltase-glucoamylase/Probable maltase-glucoamylase 2/Sucrase-isomaltase, intestinal
Name:Lysosomal alpha-glucosidase/Maltase-glucoamylase/Probable maltase-glucoamylase 2/Sucrase-isomaltase, intestinal
Synonyms:Alpha glucosidase
Type:n/a
Mol. Mass.:n/a
Description:ASSAY_ID of ChEMBL is 1720957
Components:This complex has 4 components.
Component 1
Name:Maltase-glucoamylase
Type:Enzyme
Mol. Mass.:209817.06
Organism:Homo sapiens (Human)
Description:O43451
Residue:2753
Component 2
Name:Lysosomal alpha-glucosidase
Synonyms:70 kDa lysosomal alpha-glucosidase Acid maltase Alpha glucosidase LYAG_HUMAN
Type:PROTEIN
Mol. Mass.:105312.45
Organism:Homo sapiens (Human)
Description:ChEMBL_1506060
Residue:952
Component 3
Name:Sucrase-isomaltase, intestinal
Synonyms:Alpha glucosidase SI Sucrase Sucrase-isomaltase, intestinal
Type:PROTEIN
Mol. Mass.:209423.23
Organism:Homo sapiens (Human)
Description:ChEMBL_1435477
Residue:1827
Component 4
Name:Probable maltase-glucoamylase 2
Synonyms:3.2.1.3 Glucoamylase MGAM2 Probable maltase-glucoamylase 2
Type:PROTEIN
Mol. Mass.:277932.17
Organism:Homo sapiens
Description:ChEMBL_116927
Residue:2515
BDBM23406
NameBDBM23406
Synonyms:(3R,4R,5S,6R)-5-{[(2R,3R,4R,5S,6R)-5-{[(2R,3R,4S,5S,6R)-3,4-dihydroxy-6-methyl-5-{[(1S,4R,5S,6S)-4,5,6-trihydroxy-3-(hydroxymethyl)cyclohex-2-en-1-yl]amino}oxan-2-yl]oxy}-3,4-dihydroxy-6-(hydroxymethyl)oxan-2-yl]oxy}-6-(hydroxymethyl)oxane-2,3,4-triol US11292789, Acarbose
TypeCarbohydrate
Emp. Form.C25H43NO18
Mol. Mass.645.6048
SMILESC[C@H]1O[C@H](O[C@@H]2[C@@H](CO)O[C@H](O[C@@H]3[C@@H](CO)OC(O)[C@H](O)[C@H]3O)[C@H](O)[C@H]2O)[C@H](O)[C@@H](O)[C@@H]1N[C@H]1C=C(CO)[C@@H](O)[C@H](O)[C@H]1O