Reaction Details
TargetMacrophage migration inhibitory factor
LigandBDBM50167985
Substrate/Competitorn/a
Meas. Tech.ChEMBL_1721668 (CHEMBL4136668)
Kd 210±n/a nM
Citation Dawson, TKDziedzic, PRobertson, MJCisneros, JAKrimmer, SGNewton, ASTirado-Rives, JJorgensen, WL Adding a Hydrogen Bond May Not Help: Naphthyridinone vs Quinoline Inhibitors of Macrophage Migration Inhibitory Factor. ACS Med Chem Lett8:1287-1291 (2017) 
 
Macrophage migration inhibitory factor
Name:Macrophage migration inhibitory factor
Type:Enzyme
Mol. Mass.:12478.18
Organism:Homo sapiens (Human)
Description:P14174
Residue:115
BDBM50167985
NameBDBM50167985
Synonyms:CHEMBL3798384 US10968198, Example 21
TypeSmall organic molecule
Emp. Form.C25H27N5O4
Mol. Mass.461.513
SMILESOc1ccc(cc1)-n1cc(nn1)-c1ccc2cc(OCCOCCN3CCOCC3)ccc2n1