Reaction Details
TargetMacrophage migration inhibitory factor
LigandBDBM50167988
Substrate/Competitorn/a
Meas. Tech.ChEMBL_1721668 (CHEMBL4136668)
Kd 23100±n/a nM
Citation Dawson, TKDziedzic, PRobertson, MJCisneros, JAKrimmer, SGNewton, ASTirado-Rives, JJorgensen, WL Adding a Hydrogen Bond May Not Help: Naphthyridinone vs Quinoline Inhibitors of Macrophage Migration Inhibitory Factor. ACS Med Chem Lett8:1287-1291 (2017) 
 
Macrophage migration inhibitory factor
Name:Macrophage migration inhibitory factor
Type:Enzyme
Mol. Mass.:12478.18
Organism:Homo sapiens (Human)
Description:P14174
Residue:115
BDBM50167988
NameBDBM50167988
Synonyms:CHEMBL3798703
TypeSmall organic molecule
Emp. Form.C11H11NO4
Mol. Mass.221.2093
SMILESCOC(=O)[C@H]1CC(=NO1)c1ccc(O)cc1