Reaction Details
TargetMacrophage migration inhibitory factor
LigandBDBM50206083
Substrate/Competitorn/a
Meas. Tech.ChEMBL_1721668 (CHEMBL4136668)
Kd 63±n/a nM
Citation Dawson, TKDziedzic, PRobertson, MJCisneros, JAKrimmer, SGNewton, ASTirado-Rives, JJorgensen, WL Adding a Hydrogen Bond May Not Help: Naphthyridinone vs Quinoline Inhibitors of Macrophage Migration Inhibitory Factor. ACS Med Chem Lett8:1287-1291 (2017) 
 
Macrophage migration inhibitory factor
Name:Macrophage migration inhibitory factor
Type:Enzyme
Mol. Mass.:12478.18
Organism:Homo sapiens (Human)
Description:P14174
Residue:115
BDBM50206083
NameBDBM50206083
Synonyms:CHEMBL3927658 | US10968198, Example 43
TypeSmall organic molecule
Emp. Form.C21H17FN4O4
Mol. Mass.408.3825
SMILESOC(=O)CCCOc1ccc2nc(ccc2c1)-c1cn(nn1)-c1ccc(O)c(F)c1