Reaction Details
TargetD(1A)/D(1B)/D(2)/D(3)/D(4) dopamine receptor
LigandBDBM50228774
Substrate/Competitorn/a
Meas. Tech.ChEMBL_59150 (CHEMBL671031)
Ki 89±n/a nM
Citation Lannoye, GSMoerlein, SMParkinson, DWelch, MJ N-fluoroalkylated and N-alkylated analogues of the dopaminergic D-2 receptor antagonist raclopride. J Med Chem33:2430-7 (1990) D(1A)/D(1B)/D(2)/D(3)/D(4) dopamine receptor
Name:D(1A)/D(1B)/D(2)/D(3)/D(4) dopamine receptor
Synonyms:Dopamine receptor
Type:n/a
Mol. Mass.:n/a
Description:ASSAY_ID of ChEMBL is 357782
Components:This complex has 5 components.
Component 1
Name:D(1A) dopamine receptor
Type:Enzyme
Mol. Mass.:49303.43
Organism:Homo sapiens (Human)
Description:P21728
Residue:446
Component 2
Name:D(4) dopamine receptor
Synonyms:D(2C) dopamine receptor DOPAMINE D4.2 DRD4 Dopamine D4 receptor
Type:Enzyme
Mol. Mass.:48373.19
Organism:Homo sapiens (Human)
Description:P21917
Residue:419
Component 3
Name:D(1B) dopamine receptor
Synonyms:D(5) dopamine receptor DOPAMINE D5 DRD1L2 DRD5_HUMAN | dopamine receptor D5
Type:Protein
Mol. Mass.:52943.41
Organism:Homo sapiens (Human)
Description:P21918
Residue:477
Component 4
Name:D(2) dopamine receptor
Synonyms:D(2) dopamine receptor DOPAMINE D2 Long DRD2 Dopamine D2 receptor Dopamine D2 receptor (D2R) Dopamine2-like | d2
Type:Cell-surface receptors
Mol. Mass.:50647.10
Organism:Homo sapiens (Human)
Description:P14416
Residue:443
Component 5
Name:D(3) dopamine receptor
Synonyms:DOPAMINE D3 DRD3_HUMAN Dopamine D3 receptor (D3) Dopamine receptor Dopamine receptor D3
Type:n/a
Mol. Mass.:44243.43
Organism:Homo sapiens (Human)
Description:n/a
Residue:400
BDBM50228774
NameBDBM50228774
Synonyms:CHEMBL80126
TypeSmall organic molecule
Emp. Form.C17H23Cl2FN2O3
Mol. Mass.393.281
SMILES[H][C@@]1(CNC(=O)c2c(O)c(Cl)cc(Cl)c2OC)CCCN1CCCCF