Reaction Details
TargetVasopressin V1a/V1b receptor
LigandBDBM50016309
Substrate/Competitorn/a
Meas. Tech.ChEMBL_214382 (CHEMBL821113)
Kd 170±n/a nM
Citation Grzonka, ZKasprzykowski, FKojro, EDarlak, KMelin, PFahrenholz, FCrause, PBoer, R Arginine-vasopressin analogues with high antidiuretic/vasopressor selectivity. Synthesis, biological activity, and receptor binding affinity of arginine-vasopressin analogues with substitutions in positions 1, 2, 4, 7, and 8. J Med Chem29:96-9 (1986) Vasopressin V1a/V1b receptor
Name:Vasopressin V1a/V1b receptor
Synonyms:Vasopressin V1 receptor
Type:n/a
Mol. Mass.:n/a
Description:ASSAY_ID of ChEMBL is 214265
Components:This complex has 2 components.
Component 1
Name:Vasopressin V1a receptor
Type:Enzyme Catalytic Domain
Mol. Mass.:47674.81
Organism:RAT
Description:VASOPRESSIN V1A AVPR1A RAT::P30560
Residue:424
Component 2
Name:Vasopressin V1b receptor
Synonyms:Avpr1b VASOPRESSIN V1B Vasopressin receptor
Type:Enzyme Catalytic Domain
Mol. Mass.:47104.48
Organism:RAT
Description:VASOPRESSIN V1B AVPR1B RAT::P48974
Residue:425
BDBM50016309
NameBDBM50016309
Synonyms:CHEMBL410025 | [Phe2Sar7]AVP (Arginine-vasopressin )
TypeSmall organic molecule
Emp. Form.C44H63N15O11S2
Mol. Mass.1042.195
SMILESCN(CC(=O)N[C@@H](CCCNC(N)=N)C(=O)NCC(N)=O)C(=O)[C@@H]1CSSC[C@@H](N)C(=O)N[C@H](Cc2ccccc2)C(=O)N[C@@H](Cc2ccccc2)C(=O)N[C@H](CCC(N)=O)C(=O)N[C@@H](CC(N)=O)C(=O)N1