Reaction Details
TargetVoltage-dependent L-type calcium channel subunit alpha-1C
LigandBDBM50016385
Substrate/Competitorn/a
Meas. Tech.ChEMBL_42759 (CHEMBL653729)
Kd 360±n/a nM
Citation Atwal, KSBergey, JLHedberg, AMoreland, S Synthesis and biological activity of novel calcium channel blockers: 2,5-dihydro-4-methyl-2-phenyl-1,5-benzothiazepine-3-carboxylic acid esters and 2,5-dihydro-4-methyl-2-phenyl-1,5-benzodiazepine-3-carboxylic acid esters. J Med Chem30:635-40 (1987) Voltage-dependent L-type calcium channel subunit alpha-1C
Name:Voltage-dependent L-type calcium channel subunit alpha-1C
Type:Enzyme Catalytic Domain
Mol. Mass.:248979.79
Organism:Homo sapiens (Human)
Description:Calcium channel (Type L) 0 HUMAN::Q13936
Residue:2221
BDBM50016385
NameBDBM50016385
Synonyms:4-Methyl-2-(3-nitro-phenyl)-2,5-dihydro-benzo[b][1,4]thiazepine-3-carboxylic acid methyl ester | CHEMBL158853
TypeSmall organic molecule
Emp. Form.C18H16N2O4S
Mol. Mass.356.396
SMILESCOC(=[OH+])C1=C(C)[N-]c2ccccc2SC1c1cccc(c1)[N+]([O-])=O