Reaction Details
TargetMelatonin receptor type 1A
LigandBDBM50378564
Substrate/Competitorn/a
Meas. Tech.ChEMBL_1727013 (CHEMBL4142291)
Ki 445±n/a nM
Citation Hasan, MGenovese, SFiorito, SEpifano, FWitt-Enderby, PA Oxyprenylated Phenylpropanoids Bind to MT1 Melatonin Receptors and Inhibit Breast Cancer Cell Proliferation and Migration. J Nat Prod80:3324-3329 (2017) 
 
Melatonin receptor type 1A
Name:Melatonin receptor type 1A
Type:Enzyme
Mol. Mass.:39392.94
Organism:Homo sapiens (Human)
Description:P48039
Residue:350
BDBM50378564
NameBDBM50378564
Synonyms:CHEMBL145781
TypeSmall organic molecule
Emp. Form.C16H12O3
Mol. Mass.252.2647
SMILESO=c1ccc2ccc(OCc3ccccc3)cc2o1