Reaction Details
TargetPolyunsaturated fatty acid 5-lipoxygenase
LigandBDBM50002087
Substrate/Competitorn/a
Meas. Tech.ChEBML_4054
IC50>100000±n/a nM
Citation Nishikawa, YShindo, TIshii, KNakamura, HKon, TUno, H Acrylamide derivatives as antiallergic agents. 2. Synthesis and structure-activity relationships of N-[4-[4-(diphenylmethyl)-1-piperazinyl]butyl]-3-(3-pyridyl)acryl amides. J Med Chem32:583-93 (1989) Polyunsaturated fatty acid 5-lipoxygenase
Name:Polyunsaturated fatty acid 5-lipoxygenase
Type:Enzyme
Mol. Mass.:77972.74
Organism:Homo sapiens (Human)
Description:Recombinant protein was purified from E. coli lysate. After ammonium sulfate precipitation and subsequent steps, the supernatant (S100) was used for 5-LO activity assay.
Residue:674
BDBM50002087
NameBDBM50002087
Synonyms:4-(1-Methyl-piperidin-4-ylidene)-4,9-dihydro-1-thia-benzo[f]azulen-10-one(Ketotifen hydrogen malate) 4-(1-methyl-piperidin-4-ylidene)-4,9-dihydro-1-thia-benzo[f]azulen-10-one KETOTIFEN | Zaditor
TypeSmall organic molecule
Emp. Form.C19H19NOS
Mol. Mass.309.425
SMILES[#6]-[#7]-1-[#6]-[#6]\[#6](-[#6]-[#6]-1)=[#6]-1\c2ccsc2-[#6](=O)-[#6]-c2ccccc-12