Reaction Details
TargetCarbonic anhydrase 1
LigandBDBM50174558
Substrate/Competitorn/a
Meas. Tech.ChEMBL_1727667 (CHEMBL4142945)
Ki>10000±n/a nM
Citation De Luca, LMancuso, FFerro, SBuemi, MRAngeli, ADel Prete, SCapasso, CSupuran, CTGitto, R Inhibitory effects and structural insights for a novel series of coumarin-based compounds that selectively target human CA IX and CA XII carbonic anhydrases. Eur J Med Chem143:276-282 (2018) 
 
Carbonic anhydrase 1
Name:Carbonic anhydrase 1
Type:Enzyme
Mol. Mass.:28873.37
Organism:Homo sapiens (Human)
Description:P00915
Residue:261
BDBM50174558
NameBDBM50174558
Synonyms:7-hydroxy-2H-1-benzopyran-2-one CHEMBL51628 beta-umbelliferone skimmetin | umbelliferone
TypeSmall organic molecule
Emp. Form.C9H6O3
Mol. Mass.162.1421
SMILESOc1ccc2ccc(=O)oc2c1