Reaction Details
TargetAldo-keto reductase family 1 member B1
LigandBDBM50016629
Substrate/Competitorn/a
Meas. Tech.ChEBML_157077
IC50 100±n/a nM
Citation Rizzi, JPSchnur, RCHutson, NJKraus, KGKelbaugh, PR Rotationally restricted mimics of rigid molecules: nonspirocyclic hydantoin aldose reductase inhibitors. J Med Chem32:1208-13 (1989) Aldo-keto reductase family 1 member B1
Name:Aldo-keto reductase family 1 member B1
Type:Protein
Mol. Mass.:35855.50
Organism:Homo sapiens (Human)
Description:P15121. 4LAU; 2IKI; 4LB4; 2FZD; 2FZ8; 1US0
Residue:316
BDBM50016629
NameBDBM50016629
Synonyms:4-Chloro-2-(2,5-dioxo-imidazolidin-4-yl)-N-(3-phenyl-propyl)-benzenesulfonamide | CHEMBL19711
TypeSmall organic molecule
Emp. Form.C18H18ClN3O4S
Mol. Mass.407.871
SMILESOc1[nH]c(=O)[nH]c1-c1cc(Cl)ccc1S(=O)(=O)NCCCc1ccccc1