Reaction Details
TargetAldo-keto reductase family 1 member B1
LigandBDBM50016630
Substrate/Competitorn/a
Meas. Tech.ChEBML_157077
IC50 230±n/a nM
Citation Rizzi, JPSchnur, RCHutson, NJKraus, KGKelbaugh, PR Rotationally restricted mimics of rigid molecules: nonspirocyclic hydantoin aldose reductase inhibitors. J Med Chem32:1208-13 (1989) Aldo-keto reductase family 1 member B1
Name:Aldo-keto reductase family 1 member B1
Type:Protein
Mol. Mass.:35855.50
Organism:Homo sapiens (Human)
Description:P15121. 4LAU; 2IKI; 4LB4; 2FZD; 2FZ8; 1US0
Residue:316
BDBM50016630
NameBDBM50016630
Synonyms:5-[5-Chloro-2-(hexane-1-sulfonyl)-phenyl]-imidazolidine-2,4-dione | CHEMBL18854
TypeSmall organic molecule
Emp. Form.C15H19ClN2O4S
Mol. Mass.358.84
SMILESCCCCCCS(=O)(=O)c1ccc(Cl)cc1-c1[nH]c(=O)[nH]c1O