Reaction Details
TargetAldo-keto reductase family 1 member B1
LigandBDBM50016631
Substrate/Competitorn/a
Meas. Tech.ChEMBL_31758 (CHEMBL641352)
IC50 250±n/a nM
Citation Rizzi, JPSchnur, RCHutson, NJKraus, KGKelbaugh, PR Rotationally restricted mimics of rigid molecules: nonspirocyclic hydantoin aldose reductase inhibitors. J Med Chem32:1208-13 (1989) Aldo-keto reductase family 1 member B1
Name:Aldo-keto reductase family 1 member B1
Type:Protein
Mol. Mass.:35855.50
Organism:Homo sapiens (Human)
Description:P15121. 4LAU; 2IKI; 4LB4; 2FZD; 2FZ8; 1US0
Residue:316
BDBM50016631
NameBDBM50016631
Synonyms:5-(5-Chloro-2-methanesulfinyl-phenyl)-imidazolidine-2,4-dione | CHEMBL279274
TypeSmall organic molecule
Emp. Form.C10H9ClN2O3S
Mol. Mass.272.708
SMILESCS(=O)c1ccc(Cl)cc1-c1[nH]c(=O)[nH]c1O