Reaction Details
TargetAldo-keto reductase family 1 member B1
LigandBDBM50016641
Substrate/Competitorn/a
Meas. Tech.ChEBML_157077
IC50 580±n/a nM
Citation Rizzi, JPSchnur, RCHutson, NJKraus, KGKelbaugh, PR Rotationally restricted mimics of rigid molecules: nonspirocyclic hydantoin aldose reductase inhibitors. J Med Chem32:1208-13 (1989) Aldo-keto reductase family 1 member B1
Name:Aldo-keto reductase family 1 member B1
Type:Protein
Mol. Mass.:35855.50
Organism:Homo sapiens (Human)
Description:P15121. 4LAU; 2IKI; 4LB4; 2FZD; 2FZ8; 1US0
Residue:316
BDBM50016641
NameBDBM50016641
Synonyms:5-(5-Chloro-2-methanesulfonyl-3-trifluoromethyl-phenyl)-imidazolidine-2,4-dione | CHEMBL440790
TypeSmall organic molecule
Emp. Form.C11H8ClF3N2O4S
Mol. Mass.356.705
SMILESCS(=O)(=O)c1c(cc(Cl)cc1C(F)(F)F)-c1[nH]c(=O)[nH]c1O