Reaction Details
TargetIgA-specific serine endopeptidase autotransporter
LigandBDBM50016715
Substrate/Competitorn/a
Meas. Tech.ChEBML_88880
IC50>1000000±n/a nM
Citation Wood, SGLynch, MPlaut, AGBurton, J Tetrapeptide inhibitors of the IgA1 proteinases from type I Neisseria gonorrhoeae. J Med Chem32:2407-11 (1989) IgA-specific serine endopeptidase autotransporter
Name:IgA-specific serine endopeptidase autotransporter
Type:PROTEIN
Mol. Mass.:169014.39
Organism:Neisseria gonorrhoeae
Description:ChEMBL_88881
Residue:1532
BDBM50016715
NameBDBM50016715
Synonyms:Acetylprolylserylprolylserinamide(AcPSPSNH2) | CHEMBL312188
TypeSmall organic molecule
Emp. Form.C18H29N5O7
Mol. Mass.427.4522
SMILESCC(=O)N1CCC[C@@H]1C(=O)N[C@@H](CO)C(=O)N1CCC[C@@H]1C(=O)N[C@@H](CO)C(N)=O