Reaction Details
TargetIgA-specific serine endopeptidase autotransporter
LigandBDBM50016721
Substrate/Competitorn/a
Meas. Tech.ChEBML_88880
IC50>1000000±n/a nM
Citation Wood, SGLynch, MPlaut, AGBurton, J Tetrapeptide inhibitors of the IgA1 proteinases from type I Neisseria gonorrhoeae. J Med Chem32:2407-11 (1989) IgA-specific serine endopeptidase autotransporter
Name:IgA-specific serine endopeptidase autotransporter
Type:PROTEIN
Mol. Mass.:169014.39
Organism:Neisseria gonorrhoeae
Description:ChEMBL_88881
Residue:1532
BDBM50016721
NameBDBM50016721
Synonyms:Acetylprolylthreonylprolylserinamide(AcPTPSNH2) | CHEMBL78746
TypeSmall organic molecule
Emp. Form.C19H31N5O7
Mol. Mass.441.4787
SMILESC[C@@H](O)[C@H](NC(=O)[C@H]1CCCN1C(C)=O)C(=O)N1CCC[C@@H]1C(=O)N[C@@H](CO)C(N)=O