Reaction Details
TargetIgA-specific serine endopeptidase autotransporter
LigandBDBM50016727
Substrate/Competitorn/a
Meas. Tech.ChEBML_88880
IC50>1000±n/a nM
Citation Wood, SGLynch, MPlaut, AGBurton, J Tetrapeptide inhibitors of the IgA1 proteinases from type I Neisseria gonorrhoeae. J Med Chem32:2407-11 (1989) IgA-specific serine endopeptidase autotransporter
Name:IgA-specific serine endopeptidase autotransporter
Type:PROTEIN
Mol. Mass.:169014.39
Organism:Neisseria gonorrhoeae
Description:ChEMBL_88881
Residue:1532
BDBM50016727
NameBDBM50016727
Synonyms:1-(2-{[1-(1-Acetyl-pyrrolidine-2-carbonyl)-pyrrolidine-2-carbonyl]-amino}-3-hydroxy-butyryl)-pyrrolidine-2-carboxylic acid | CHEMBL309240
TypeSmall organic molecule
Emp. Form.C21H32N4O7
Mol. Mass.452.5014
SMILESC[C@@H](O)[C@H](NC(=O)[C@@H]1CCCN1C(=O)[C@H]1CCCN1C(C)=O)C(=O)N1CCC[C@H]1C(O)=O