Reaction Details
TargetCannabinoid receptor 1
LigandBDBM50288368
Substrate/Competitorn/a
Meas. Tech.ChEMBL_1729892 (CHEMBL4145170)
EC50 0.430000±n/a nM
Citation Roy, JWatson, JEHong, ISFan, TMDas, A Antitumorigenic Properties of Omega-3 Endocannabinoid Epoxides. J Med Chem61:5569-5579 (2018) 
 
Cannabinoid receptor 1
Name:Cannabinoid receptor 1
Type:G Protein-Coupled Receptor (GPCR)
Mol. Mass.:52868.96
Organism:Homo sapiens (Human)
Description:P21554
Residue:472
BDBM50288368
NameBDBM50288368
Synonyms:CHEMBL4161934 | US11472787, Compound 10,11-EDP-EA
TypeSmall organic molecule
Emp. Form.C24H37NO3
Mol. Mass.387.5555
SMILESCC\C=C/C\C=C/C\C=C/CC1OC1C\C=C/C\C=C/CCC(=O)NCCO