Reaction Details
TargetCannabinoid receptor 1
LigandBDBM50288371
Substrate/Competitorn/a
Meas. Tech.ChEMBL_1729892 (CHEMBL4145170)
EC50 0.070000±n/a nM
Citation Roy, JWatson, JEHong, ISFan, TMDas, A Antitumorigenic Properties of Omega-3 Endocannabinoid Epoxides. J Med Chem61:5569-5579 (2018) 
 
Cannabinoid receptor 1
Name:Cannabinoid receptor 1
Type:G Protein-Coupled Receptor (GPCR)
Mol. Mass.:52868.96
Organism:Homo sapiens (Human)
Description:P21554
Residue:472
BDBM50288371
NameBDBM50288371
Synonyms:CHEMBL4177060 | US11472787, Compound 10,11-EDP-IA
TypeSmall organic molecule
Emp. Form.C25H39NO3
Mol. Mass.401.5821
SMILESCC\C=C/C\C=C/C\C=C/CC1OC1C\C=C/C\C=C/CCC(=O)NC(C)CO