Reaction Details
Target5-hydroxytryptamine receptor 1A
LigandBDBM50016892
Substrate/Competitorn/a
Meas. Tech.ChEBML_849
IC50 75.0±n/a nM
Citation Hutchison, AWilliams, Mde Jesus, RStone, GASylvester, LClarke, FHSills, MA 2H-[1]benzopyrano[3,4-b]pyridines: synthesis and activity at central monoamine receptors. J Med Chem32:720-7 (1989) 5-hydroxytryptamine receptor 1A
Name:5-hydroxytryptamine receptor 1A
Type:G Protein-Coupled Receptor (GPCR)
Mol. Mass.:46445.29
Organism:Rattus norvegicus (rat)
Description:Binding assays were performed using rat hippocampal membranes.
Residue:422
BDBM50016892
NameBDBM50016892
Synonyms:5-Methoxy-1,7-dimethyl-2,3,4,4a,10,10a-hexahydro-1H-9-oxa-1-aza-phenanthrene | CHEMBL162449
TypeSmall organic molecule
Emp. Form.C15H21NO2
Mol. Mass.247.3327
SMILESCOc1cc(C)cc2OC[C@@H]3[C@H](CCCN3C)c12