Reaction Details
TargetALK tyrosine kinase receptor
LigandBDBM50044303
Substrate/Competitorn/a
Meas. Tech.ChEMBL_1730671 (CHEMBL4146207)
IC50 2.7±n/a nM
Citation Geng, KXia, ZJi, YZhang, RRSun, DAi, JSong, ZGeng, MZhang, A Discovery of 2,4-diarylaminopyrimidines bearing a resorcinol motif as novel ALK inhibitors to overcome the G1202R resistant mutation. Eur J Med Chem144:386-397 (2018) 
 
ALK tyrosine kinase receptor
Name:ALK tyrosine kinase receptor
Type:Protein
Mol. Mass.:176453.10
Organism:Homo sapiens (Human)
Description:Q9UM73
Residue:1620
BDBM50044303
NameBDBM50044303
Synonyms:CHEMBL3357439
TypeSmall organic molecule
Emp. Form.C21H23ClN6O3S
Mol. Mass.474.964
SMILESCC(C)S(=O)(=O)c1ccccc1Nc1nc(Nc2cccc(NC(=O)CN)c2)ncc1Cl