Reaction Details
TargetSerine/threonine-protein kinase Chk2
LigandBDBM50291372
Substrate/Competitorn/a
Meas. Tech.ChEMBL_1731081 (CHEMBL4146617)
IC50 11±n/a nM
Citation Galal, SAKhairat, SHMAli, HIShouman, SAAttia, YMAli, MMMahmoud, AEAbdel-Halim, AHFyiad, AATabll, AEl-Shenawy, REl Abd, YSRamdan, REl Diwani, HI Part II: New candidates of pyrazole-benzimidazole conjugates as checkpoint kinase 2 (Chk2) inhibitors. Eur J Med Chem144:859-873 (2018) 
 
Serine/threonine-protein kinase Chk2
Name:Serine/threonine-protein kinase Chk2
Type:Protein
Mol. Mass.:60908.59
Organism:Homo sapiens (Human)
Description:O96017
Residue:543
BDBM50291372
NameBDBM50291372
Synonyms:CHEMBL4177291
TypeSmall organic molecule
Emp. Form.C25H20N8O3S
Mol. Mass.512.543
SMILESCc1nn(c(Oc2ccc(cc2)-c2nc3cc(ccc3[nH]2)[N+]([O-])=O)c1\C=N\NC(N)=S)-c1ccccc1