Reaction Details
TargetSerine/threonine-protein kinase Chk2
LigandBDBM50291405
Substrate/Competitorn/a
Meas. Tech.ChEMBL_1731081 (CHEMBL4146617)
IC50 13±n/a nM
Citation Galal, SAKhairat, SHMAli, HIShouman, SAAttia, YMAli, MMMahmoud, AEAbdel-Halim, AHFyiad, AATabll, AEl-Shenawy, REl Abd, YSRamdan, REl Diwani, HI Part II: New candidates of pyrazole-benzimidazole conjugates as checkpoint kinase 2 (Chk2) inhibitors. Eur J Med Chem144:859-873 (2018) 
 
Serine/threonine-protein kinase Chk2
Name:Serine/threonine-protein kinase Chk2
Type:Protein
Mol. Mass.:60908.59
Organism:Homo sapiens (Human)
Description:O96017
Residue:543
BDBM50291405
NameBDBM50291405
Synonyms:CHEMBL4173655
TypeSmall organic molecule
Emp. Form.C26H21N7O3S
Mol. Mass.511.555
SMILESCc1nn(c(Oc2ccc(cc2)-c2nc3cc(ccc3[nH]2)C(O)=O)c1\C=N\NC(N)=S)-c1ccccc1