Reaction Details
TargetCysteinyl leukotriene receptor 1/2
LigandBDBM50009075
Substrate/Competitorn/a
Meas. Tech.ChEMBL_52049 (CHEMBL666435)
IC50 1±n/a nM
Citation Cohen, NWeber, GBanner, BLLopresti, RJSchaer, BFocella, AZenchoff, GBChiu, AMTodaro, LO'Donnell, M 3,4-Dihydro-2H-1-benzopyran-2-carboxylic acids and related compounds as leukotriene antagonists. J Med Chem32:1842-60 (1989) Cysteinyl leukotriene receptor 1/2
Name:Cysteinyl leukotriene receptor 1/2
Synonyms:Cysteinyl leukotriene receptor
Type:n/a
Mol. Mass.:n/a
Description:ASSAY_ID of ChEMBL is 98640
Components:This complex has 2 components.
Component 1
Name:Cysteinyl leukotriene receptor 1
Type:Enzyme Catalytic Domain
Mol. Mass.:38565.16
Organism:Homo sapiens (Human)
Description:Leukotriene Cysteinyl 1 CYSLTR1 HUMAN::Q9Y271
Residue:337
Component 2
Name:Cysteinyl leukotriene receptor 2
Synonyms:CLTR2_HUMAN CYSLT2R Cysteinyl leukotriene receptor Leukotriene Cysteinyl 2
Type:Enzyme Catalytic Domain
Mol. Mass.:39657.52
Organism:Homo sapiens (Human)
Description:Leukotriene Cysteinyl 2 CYSLTR2 HUMAN::Q9NS75
Residue:346
BDBM50009075
NameBDBM50009075
Synonyms:CHEMBL22033 ICI-198615 [1-(4-Benzenesulfonylaminocarbonyl-2-methoxy-benzyl)-1H-indazol-6-yl]-carbamic acid cyclopentyl ester [1-(4-Benzenesulfonylaminocarbonyl-2-methoxy-benzyl)-1H-indazol-6-yl]-carbamic acid cyclopentyl ester(ICI 198, 615) | [1-(4-Benzenesulfonylaminocarbonyl-2-methoxy-benzyl)-1H-indazol-6-yl]-carbamic acid cyclopentyl ester(ICI 198615)
TypeSmall organic molecule
Emp. Form.C28H28N4O6S
Mol. Mass.548.61
SMILESCOc1cc(ccc1Cn1ncc2ccc(NC(=O)OC3CCCC3)cc12)C(=O)NS(=O)(=O)c1ccccc1