Reaction Details
TargetHeme oxygenase 1
LigandBDBM31663
Substrate/Competitorn/a
Meas. Tech.ChEBML_1733252
IC50 2100±n/a nM
Citation Salerno, LAmata, ERomeo, GMarrazzo, APrezzavento, OFloresta, GSorrenti, VBarbagallo, IRescifina, APittalą, V Potholing of the hydrophobic heme oxygenase-1 western region for the search of potent and selective imidazole-based inhibitors. Eur J Med Chem148:54-62 (2018) 
 
Heme oxygenase 1
Name:Heme oxygenase 1
Type:Enzyme
Mol. Mass.:33005.15
Organism:Rattus norvegicus (rat)
Description:HO-1 obtained from rat spleen was used in enzyme assays.
Residue:289
BDBM31663
NameBDBM31663
Synonyms:imidazole-dioxolane, 15
TypeSmall organic molecule
Emp. Form.C22H21ClF3N3O2S
Mol. Mass.483.934
SMILESFC(F)(F)c1ccc(SC[C@@H]2CO[C@@](CCc3ccc(Cl)cc3)(Cn3ccnc3)O2)nc1