Reaction Details
TargetCalcium-dependent protein kinase 1
LigandBDBM36336
Substrate/Competitorn/a
Meas. Tech.ChEMBL_1734033 (CHEMBL4149569)
IC50 13±n/a nM
Citation Cabrera, DGHoratscheck, AWilson, CRBasarab, GEyermann, CJChibale, K Plasmodial Kinase Inhibitors: License to Cure? J Med Chem61:8061-8077 (2018) 
 
Calcium-dependent protein kinase 1
Name:Calcium-dependent protein kinase 1
Type:PROTEIN
Mol. Mass.:60804.87
Organism:Plasmodium Falciparum
Description:P62343
Residue:524
BDBM36336
NameBDBM36336
Synonyms:CID24762166 | Purfalcamine, 1
TypeSmall organic molecule
Emp. Form.C29H33FN8O
Mol. Mass.528.6237
SMILESN[C@H]1CC[C@@H](CC1)Nc1nc(Nc2ccc(cc2)C(=O)N2CCCCC2)c2ncn(-c3cccc(F)c3)c2n1