Reaction Details
TargetDopamine beta-hydroxylase
LigandBDBM50017831
Substrate/Competitorn/a
Meas. Tech.ChEBML_59142
Ki 5000±n/a nM
Citation Farrington, GKKumar, AVillafranca, JJ Benzofurans as mechanism-based inhibitors of dopamine beta-hydroxylase. J Med Chem32:735-7 (1989) Dopamine beta-hydroxylase
Name:Dopamine beta-hydroxylase
Type:PROTEIN
Mol. Mass.:68136.39
Organism:Bos taurus
Description:ChEMBL_50738
Residue:610
BDBM50017831
NameBDBM50017831
Synonyms:2-[1,3]Dithiolan-2-ylidene-ethylamine | CHEMBL163500
TypeSmall organic molecule
Emp. Form.C5H9NS2
Mol. Mass.147.262
SMILES[#7]-[#6]\[#6]=[#6]-1/[#16]-[#6]-[#6]-[#16]-1