Reaction Details
TargetDopamine beta-hydroxylase
LigandBDBM50017833
Substrate/Competitorn/a
Meas. Tech.ChEBML_59142
Ki 700000±n/a nM
Citation Farrington, GKKumar, AVillafranca, JJ Benzofurans as mechanism-based inhibitors of dopamine beta-hydroxylase. J Med Chem32:735-7 (1989) Dopamine beta-hydroxylase
Name:Dopamine beta-hydroxylase
Type:PROTEIN
Mol. Mass.:68136.39
Organism:Bos taurus
Description:ChEMBL_50738
Residue:610
BDBM50017833
NameBDBM50017833
Synonyms:4-Hydroxystyrene 4-ethenylphenol p-Hydroxystyrene | p-Vinylphenol
TypeSmall organic molecule
Emp. Form.C8H8O
Mol. Mass.120.1485
SMILESOc1ccc(C=C)cc1