Reaction Details
TargetCatechol O-methyltransferase
LigandBDBM50017846
Substrate/Competitorn/a
Meas. Tech.ChEBML_47065
IC50 12±n/a nM
Citation Bäckström, RHonkanen, EPippuri, AKairisalo, PPystynen, JHeinola, KNissinen, ELinden, IBMännistö, PTKaakkola, S Synthesis of some novel potent and selective catechol O-methyltransferase inhibitors. J Med Chem32:841-6 (1989) Catechol O-methyltransferase
Name:Catechol O-methyltransferase
Type:Enzyme
Mol. Mass.:29594.09
Organism:Rattus norvegicus (Rat)
Description:n/a
Residue:264
BDBM50017846
NameBDBM50017846
Synonyms:3,5-DINITROCATECHOL CHEMBL168276 US11337935, 3,5-dinitrocatechol
TypeSmall organic molecule
Emp. Form.C6H4N2O6
Mol. Mass.200.1058
SMILESOc1cc(cc(c1O)[N+]([O-])=O)[N+]([O-])=O