Reaction Details
TargetThymidylate synthase
LigandBDBM50017874
Substrate/Competitorn/a
Meas. Tech.ChEBML_209958
IC50 1120±n/a nM
Citation Jones, TRThornton, TJFlinn, AJackman, ALNewell, DRCalvert, AH Quinazoline antifolates inhibiting thymidylate synthase: 2-desamino derivatives with enhanced solubility and potency. J Med Chem32:847-52 (1989) Thymidylate synthase
Name:Thymidylate synthase
Type:PROTEIN
Mol. Mass.:34957.15
Organism:Mus musculus
Description:ChEMBL_1340097
Residue:307
BDBM50017874
NameBDBM50017874
Synonyms:2-{4-[Allyl-(4-oxo-3,4-dihydro-quinazolin-6-ylmethyl)-amino]-benzoylamino}-pentanedioic acid | CHEMBL423270
TypeSmall organic molecule
Emp. Form.C24H24N4O6
Mol. Mass.464.4706
SMILESOC(=O)CCC(NC(=O)c1ccc(cc1)N(CC=C)Cc1ccc2nc[nH]c(=O)c2c1)C(O)=O