Reaction Details
TargetThymidylate synthase
LigandBDBM50006907
Substrate/Competitorn/a
Meas. Tech.ChEBML_210160
IC50 22720±n/a nM
Citation Jones, TRThornton, TJFlinn, AJackman, ALNewell, DRCalvert, AH Quinazoline antifolates inhibiting thymidylate synthase: 2-desamino derivatives with enhanced solubility and potency. J Med Chem32:847-52 (1989) Thymidylate synthase
Name:Thymidylate synthase
Type:Enzyme
Mol. Mass.:36576.54
Organism:Lactobacillus casei
Description:n/a
Residue:316
BDBM50006907
NameBDBM50006907
Synonyms:2-{4-[(4-Oxo-3,4-dihydro-quinazolin-6-ylmethyl)-amino]-benzoylamino}-pentanedioic acid | CHEMBL89641
TypeSmall organic molecule
Emp. Form.C21H20N4O6
Mol. Mass.424.4067
SMILESOC(=O)CCC(NC(=O)c1ccc(NCc2ccc3nc[nH]c(=O)c3c2)cc1)C(O)=O