Reaction Details
TargetAdenosine receptor A1
LigandBDBM50007838
Substrate/Competitorn/a
Meas. Tech.ChEMBL_29616 (CHEMBL639639)
Ki 1.3±n/a nM
Citation Shamim, MTUkena, DPadgett, WLDaly, JW Effects of 8-phenyl and 8-cycloalkyl substituents on the activity of mono-, di-, and trisubstituted alkylxanthines with substitution at the 1-, 3-, and 7-positions. J Med Chem32:1231-7 (1989) Adenosine receptor A1
Name:Adenosine receptor A1
Type:Protein
Mol. Mass.:36704.13
Organism:Rattus norvegicus (rat)
Description:n/a
Residue:326
BDBM50007838
NameBDBM50007838
Synonyms:8-Cyclohexyl-1,3-dipropyl-3,7-dihydro-purine-2,6-dione CHEMBL160369
TypeSmall organic molecule
Emp. Form.C17H26N4O2
Mol. Mass.318.4139
SMILESCCCn1c2nc([nH]c2c(=O)n(CCC)c1=O)C1CCCCC1