Reaction Details
TargetKelch-like ECH-associated protein 1
LigandBDBM50006932
Substrate/Competitorn/a
Meas. Tech.ChEMBL_1736593 (CHEMBL4152129)
Kd 20±n/a nM
Citation Richardson, BGJain, ADPotteti, HRLazzara, PRDavid, BPTamatam, CRChoma, ESkowron, KDye, KSiddiqui, ZWang, YTKrunic, AReddy, SPMoore, TW Replacement of a Naphthalene Scaffold in Kelch-like ECH-Associated Protein 1 (KEAP1)/Nuclear Factor (Erythroid-derived 2)-like 2 (NRF2) Inhibitors. J Med Chem61:8029-8047 (2018) 
 
Kelch-like ECH-associated protein 1
Name:Kelch-like ECH-associated protein 1
Type:PROTEIN
Mol. Mass.:69664.53
Organism:Homo sapiens (Human)
Description:ChEMBL_107924
Residue:624
BDBM50006932
NameBDBM50006932
Synonyms:CHEMBL3237245
TypeSmall organic molecule
Emp. Form.C28H26N2O10S2
Mol. Mass.614.643
SMILESCOc1ccc(cc1)S(=O)(=O)N(CC(O)=O)c1ccc(N(CC(O)=O)S(=O)(=O)c2ccc(OC)cc2)c2ccccc12