Reaction Details
TargetCarbonic anhydrase 4
LigandBDBM50369885
Substrate/Competitorn/a
Meas. Tech.ChEMBL_1737219 (CHEMBL4152969)
Ki 7.8±n/a nM
Citation Chiaramonte, NBua, SFerraroni, MNocentini, ABonardi, ABartolucci, GDurante, MLucarini, LChiapponi, DDei, SManetti, DTeodori, EGratteri, PMasini, ESupuran, CTRomanelli, MN 2-Benzylpiperazine: A new scaffold for potent human carbonic anhydrase inhibitors. Synthesis, enzyme inhibition, enantioselectivity, computational and crystallographic studies and in vivo activity for a new class of intraocular pressure lowering agents. Eur J Med Chem151:363-375 (2018) 
 
Carbonic anhydrase 4
Name:Carbonic anhydrase 4
Type:Enzyme
Mol. Mass.:35037.98
Organism:Homo sapiens (Human)
Description:P22748
Residue:312
BDBM50369885
NameBDBM50369885
Synonyms:CHEMBL4173083
TypeSmall organic molecule
Emp. Form.C25H25N3O4S
Mol. Mass.463.549
SMILESNS(=O)(=O)c1ccc(cc1)C(=O)N1CCN(C[C@@H]1Cc1ccccc1)C(=O)c1ccccc1