Reaction Details
TargetCarbonic anhydrase 2
LigandBDBM50369819
Substrate/Competitorn/a
Meas. Tech.ChEMBL_1737218 (CHEMBL4152968)
Ki 4.8±n/a nM
Citation Chiaramonte, NBua, SFerraroni, MNocentini, ABonardi, ABartolucci, GDurante, MLucarini, LChiapponi, DDei, SManetti, DTeodori, EGratteri, PMasini, ESupuran, CTRomanelli, MN 2-Benzylpiperazine: A new scaffold for potent human carbonic anhydrase inhibitors. Synthesis, enzyme inhibition, enantioselectivity, computational and crystallographic studies and in vivo activity for a new class of intraocular pressure lowering agents. Eur J Med Chem151:363-375 (2018) 
 
Carbonic anhydrase 2
Name:Carbonic anhydrase 2
Type:Enzyme
Mol. Mass.:29250.71
Organism:Homo sapiens (Human)
Description:P00918
Residue:260
BDBM50369819
NameBDBM50369819
Synonyms:CHEMBL4163666
TypeSmall organic molecule
Emp. Form.C26H27N3O4S
Mol. Mass.477.575
SMILESNS(=O)(=O)c1ccc(cc1)C(=O)N1CCN(C[C@H]1Cc1ccccc1)C(=O)Cc1ccccc1