Reaction Details
TargetMuscarinic acetylcholine receptor M2
LigandBDBM50018310
Substrate/Competitorn/a
Meas. Tech.ChEBML_140037
IC50 560±n/a nM
Citation Engel, WWEberlein, WGMihm, GHammer, RTrummlitz, G Tricyclic compounds as selective muscarinic receptor antagonists. 3. Structure-selectivity relationships in a series of cardioselective (M2) antimuscarinics. J Med Chem32:1718-24 (1989) Muscarinic acetylcholine receptor M2
Name:Muscarinic acetylcholine receptor M2
Type:Enzyme Catalytic Domain
Mol. Mass.:51555.53
Organism:RAT
Description:P10980
Residue:466
BDBM50018310
NameBDBM50018310
Synonyms:11-[2-(2-Pyrrolidin-1-ylmethyl-piperidin-1-yl)-acetyl]-5,11-dihydro-benzo[e]pyrido[3,2-b][1,4]diazepin-6-one | CHEMBL410928
TypeSmall organic molecule
Emp. Form.C24H29N5O2
Mol. Mass.419.5194
SMILESO=C(CN1CCCCC1CN1CCCC1)N1c2ccccc2C(=O)Nc2cccnc12