Reaction Details
TargetMuscarinic acetylcholine receptor M2
LigandBDBM50018311
Substrate/Competitorn/a
Meas. Tech.ChEMBL_140036 (CHEMBL744016)
IC50 600±n/a nM
Citation Engel, WWEberlein, WGMihm, GHammer, RTrummlitz, G Tricyclic compounds as selective muscarinic receptor antagonists. 3. Structure-selectivity relationships in a series of cardioselective (M2) antimuscarinics. J Med Chem32:1718-24 (1989) Muscarinic acetylcholine receptor M2
Name:Muscarinic acetylcholine receptor M2
Type:Enzyme Catalytic Domain
Mol. Mass.:51555.53
Organism:RAT
Description:P10980
Residue:466
BDBM50018311
NameBDBM50018311
Synonyms:11-[2-(2-Piperidin-1-ylmethyl-piperidin-1-yl)-acetyl]-5,11-dihydro-benzo[e]pyrido[3,2-b][1,4]diazepin-6-one | CHEMBL45983
TypeSmall organic molecule
Emp. Form.C25H31N5O2
Mol. Mass.433.5459
SMILESO=C(CN1CCCCC1CN1CCCCC1)N1c2ccccc2C(=O)Nc2cccnc12