Reaction Details
Target5-hydroxytryptamine receptor 1A
LigandBDBM50018459
Substrate/Competitorn/a
Meas. Tech.ChEMBL_1100 (CHEMBL616423)
Ki 3.3±n/a nM
Citation Glennon, RANaiman, NAPierson, MESmith, JDIsmaiel, AMTiteler, MLyon, RA N-(phthalimidoalkyl) derivatives of serotonergic agents: a common interaction at 5-HT1A serotonin binding sites? J Med Chem32:1921-6 (1989) 5-hydroxytryptamine receptor 1A
Name:5-hydroxytryptamine receptor 1A
Type:G Protein-Coupled Receptor (GPCR)
Mol. Mass.:46445.29
Organism:Rattus norvegicus (rat)
Description:Binding assays were performed using rat hippocampal membranes.
Residue:422
BDBM50018459
NameBDBM50018459
Synonyms:1-(7-Methoxy-naphthalen-1-yl)-piperazine CHEMBL300824
TypeSmall organic molecule
Emp. Form.C15H18N2O
Mol. Mass.242.3162
SMILESCOc1ccc2cccc(N3CCNCC3)c2c1