Reaction Details
TargetSqualene monooxygenase
LigandBDBM50018518
Substrate/Competitorn/a
Meas. Tech.ChEMBL_201793 (CHEMBL806128)
Ki 30±n/a nM
Citation Sen, SEPrestwich, GD Squalene analogues containing isopropylidene mimics as potential inhibitors of pig liver squalene epoxidase and oxidosqualene cyclase. J Med Chem32:2152-8 (1989) Squalene monooxygenase
Name:Squalene monooxygenase
Type:PROTEIN
Mol. Mass.:63936.94
Organism:Homo sapiens (Human)
Description:ChEMBL_201924
Residue:574
BDBM50018518
NameBDBM50018518
Synonyms:((E)-6,6-Dimethyl-hept-2-en-4-ynyl)-methyl-naphthalen-1-ylmethyl-amine (6,6-Dimethyl-hept-2-en-4-ynyl)-methyl-naphthalen-1-ylmethyl-amine(Terbinafine) 1N,6,6-trimethyl-1N-(1-naphthylmethyl)-(E)-2-hepten-4-yn-1-amine Lamisil N,6,6-trimethyl-N-(naphthalen-1-ylmethyl)hept-2-en-4-yn-1-amine SF-86-327 Terbinafin cid_1549008
TypeSmall organic molecule
Emp. Form.C21H25N
Mol. Mass.291.4299
SMILESCN(C\C=C\C#CC(C)(C)C)Cc1cccc2ccccc12