Reaction Details
TargetThromboxane A2 receptor
LigandBDBM50228337
Substrate/Competitorn/a
Meas. Tech.ChEMBL_209433 (CHEMBL814290)
IC50 210±n/a nM
CommentsZero 12/22/2021
Citation Shiraishi, MKato, KTerao, SAshida, YTerashita, ZKito, G Quinones. 4. Novel eicosanoid antagonists: synthesis and pharmacological evaluation. J Med Chem32:2214-21 (1989) Thromboxane A2 receptor
Name:Thromboxane A2 receptor
Type:Enyzme
Mol. Mass.:37445.28
Organism:Homo sapiens (Human)
Description:P21731
Residue:343
BDBM50228337
NameBDBM50228337
Synonyms:CHEMBL71921
TypeSmall organic molecule
Emp. Form.C22H26O4
Mol. Mass.354.4394
SMILES[H][C@@](CCCCCC(O)=O)(C1=C(C)C(=O)C(C)=C(C)C1=O)c1ccccc1