Reaction Details
TargetAdenosine receptor A1
LigandBDBM15336
Substrate/Competitorn/a
Meas. Tech.ChEBML_28990
Ki 2500±n/a nM
Citation Schneller, SWIbay, ACChrist, WJBruns, RF Linear and proximal benzo-separated alkylated xanthines as adenosine-receptor antagonists. J Med Chem32:2247-54 (1989) Adenosine receptor A1
Name:Adenosine receptor A1
Type:Protein
Mol. Mass.:36704.13
Organism:Rattus norvegicus (rat)
Description:n/a
Residue:326
BDBM15336
NameBDBM15336
Synonyms:1-methyl-3-(2-methylpropyl)-2,3,6,7-tetrahydro-1H-purine-2,6-dione 3-Isobutyl-1-methylxanthine IBMX | isobutylmethylxanthine
TypeSmall organic molecule
Emp. Form.C10H14N4O2
Mol. Mass.222.2438
SMILESCC(C)Cn1c2nc[nH]c2c(=O)n(C)c1=O