Reaction Details
TargetCarbonic anhydrase 5B, mitochondrial
LigandBDBM50449834
Substrate/Competitorn/a
Meas. Tech.ChEMBL_1740763 (CHEMBL4156513)
Kd 0.600000±n/a nM
Citation Zak?auskas, A?apkauskait?, EJezep?ikas, LLinkuvien?, VKi?onait?, MSmirnov, AManakova, EGra?ulis, SMatulis, D Design of two-tail compounds with rotationally fixed benzenesulfonamide ring as inhibitors of carbonic anhydrases. Eur J Med Chem156:61-78 (2018) 
 
Carbonic anhydrase 5B, mitochondrial
Name:Carbonic anhydrase 5B, mitochondrial
Type:Enzyme
Mol. Mass.:36440.83
Organism:Homo sapiens (Human)
Description:Human (cloned) isozyme
Residue:317
BDBM50449834
NameBDBM50449834
Synonyms:CHEMBL4173501
TypeSmall organic molecule
Emp. Form.C13H16Cl2N2O3S
Mol. Mass.351.249
SMILESNS(=O)(=O)c1cc(C(=O)NC2CCCCC2)c(Cl)cc1Cl