Reaction Details
TargetCarbonic anhydrase 5B, mitochondrial
LigandBDBM50449836
Substrate/Competitorn/a
Meas. Tech.ChEMBL_1740763 (CHEMBL4156513)
Kd 0.110000±n/a nM
Citation Zak?auskas, A?apkauskait?, EJezep?ikas, LLinkuvien?, VKi?onait?, MSmirnov, AManakova, EGra?ulis, SMatulis, D Design of two-tail compounds with rotationally fixed benzenesulfonamide ring as inhibitors of carbonic anhydrases. Eur J Med Chem156:61-78 (2018) 
 
Carbonic anhydrase 5B, mitochondrial
Name:Carbonic anhydrase 5B, mitochondrial
Type:Enzyme
Mol. Mass.:36440.83
Organism:Homo sapiens (Human)
Description:Human (cloned) isozyme
Residue:317
BDBM50449836
NameBDBM50449836
Synonyms:CHEMBL4166643
TypeSmall organic molecule
Emp. Form.C11H14Br2N2O3S
Mol. Mass.414.113
SMILESCCCCNC(=O)c1cc(c(Br)cc1Br)S(N)(=O)=O