Reaction Details
TargetCarbonic anhydrase 5B, mitochondrial
LigandBDBM50449813
Substrate/Competitorn/a
Meas. Tech.ChEMBL_1740748 (CHEMBL4156498)
Kd 7690±n/a nM
Citation Zak?auskas, A?apkauskait?, EJezep?ikas, LLinkuvien?, VKi?onait?, MSmirnov, AManakova, EGra?ulis, SMatulis, D Design of two-tail compounds with rotationally fixed benzenesulfonamide ring as inhibitors of carbonic anhydrases. Eur J Med Chem156:61-78 (2018) 
 
Carbonic anhydrase 5B, mitochondrial
Name:Carbonic anhydrase 5B, mitochondrial
Type:Enzyme
Mol. Mass.:36440.83
Organism:Homo sapiens (Human)
Description:Human (cloned) isozyme
Residue:317
BDBM50449813
NameBDBM50449813
Synonyms:CHEMBL4170792
TypeSmall organic molecule
Emp. Form.C17H20ClN3O4S
Mol. Mass.397.876
SMILESNS(=O)(=O)c1cc(C(=O)NCCCO)c(NCc2ccccc2)cc1Cl